{"text_format":"1","workbook":"xlsx","n_sheets":11,"sheets":["Cover_sheet","OTP_Config_Report","Load_OTP_&_Apply","OTP_conf_file_generation","OTP_conf_summary","OTP_conf_main_reg","OTP_conf_main_bits","OTP_conf_failsafe_reg","OTP_conf_failsafe_bits","FS84_VPRE_VBOOST_Components","Normalized_R_C_Values"],"not_rendered":{"charts":2,"images":10,"macros":1,"external_links":2,"defined_names":162,"comments":1,"pivot_tables":0},"unopened":[],"bounds":{"document_bytes":16777216,"sheet_cells":100000,"rows_first":2000,"rows_last":500,"rows_between":2000,"halvings":0,"cell_chars":16384,"cell_head_chars":4096},"cells_cut":0,"cells_raw":0,"read":"whole","date_system":"1900"}

{"sheet":"Cover_sheet","index":0,"n_rows":36,"n_cols":4,"rows_kept":36,"cut":false,"hidden":false,"merged":[]}
[]
[]
[]
[]
[]
[]
["Document ID: "]
["      FS84_QFN48EP_OTP_Config"]
[]
["Document Description:"]
{"$rows_left_out":27}
{"sheet":"OTP_Config_Report","index":1,"n_rows":349,"n_cols":14,"rows_kept":349,"cut":false,"hidden":false,"merged":[[347,10,347,11],[239,1,245,2],[239,3,239,6],[239,7,239,9],[240,3,240,6],[240,7,240,9],[241,3,241,6],[241,7,241,9],[242,3,242,6],[242,7,242,9],[243,3,243,6],[243,7,243,9],[244,3,244,6],[244,7,244,9],[245,3,245,6],[245,7,245,9],[168,7,168,9],[168,3,168,6],[194,1,197,2],[194,3,194,6],[194,7,194,9],[172,3,172,6],[172,7,172,9],[169,1,172,2],[173,3,173,6],[173,7,173,9],[169,3,169,6],[169,7,169,9],[170,3,170,6],[170,7,170,9],[171,3,171,6],[171,7,171,9],[178,7,178,9],[175,3,175,6],[182,1,182,2],[182,3,182,6],[182,7,182,9],[179,3,179,6],[179,7,179,9],[176,3,176,6],[167,7,167,9],[167,3,167,6],[166,7,166,9],[166,3,166,6],[165,7,165,9],[165,3,165,6],[165,1,168,2],[189,1,193,2],[189,3,189,6],[189,7,189,9],[190,3,190,6],[191,3,191,6],[191,7,191,9],[192,3,192,6],[192,7,192,9],[193,3,193,6],[193,7,193,9],[176,7,176,9],[177,3,177,6],[177,7,177,9],[178,3,178,6],[175,7,175,9],[174,3,174,6],[174,7,174,9],[218,1,221,2],[218,3,218,6],[219,3,219,6],[220,3,220,6],[221,3,221,6],[238,3,238,6],[238,7,238,9],[214,1,217,2],[222,1,225,2],[226,1,232,2],[233,1,238,2],[235,3,235,6],[235,7,235,9],[236,3,236,6],[236,7,236,9],[237,3,237,6],[237,7,237,9],[232,3,232,6],[232,7,232,9],[233,3,233,6],[233,7,233,9],[234,3,234,6],[234,7,234,9],[229,3,229,6],[229,7,229,9],[230,3,230,6],[230,7,230,9],[231,3,231,6],[231,7,231,9],[226,3,226,6],[226,7,226,9],[227,3,227,6],[227,7,227,9],[228,3,228,6],[228,7,228,9],[223,3,223,6],[223,7,223,9],[224,3,224,6],[224,7,224,9],[225,3,225,6],[225,7,225,9],[220,7,220,9],[221,7,221,9],[222,3,222,6],[222,7,222,9],[183,3,183,6],[183,7,183,9],[190,7,190,9],[217,3,217,6],[217,7,217,9],[218,7,218,9],[219,7,219,9],[214,3,214,6],[214,7,214,9],[215,3,215,6],[215,7,215,9],[216,3,216,6],[216,7,216,9],[142,3,142,6],[142,7,142,9],[145,3,145,6],[145,7,145,9],[213,1,213,2],[213,3,213,6],[213,7,213,9],[188,3,188,6],[188,7,188,9],[183,1,188,2],[184,3,184,6],[184,7,184,9],[185,3,185,6],[185,7,185,9],[186,3,186,6],[186,7,186,9],[187,3,187,6],[187,7,187,9],[195,3,195,6],[195,7,195,9],[196,3,196,6],[196,7,196,9],[197,3,197,6],[197,7,197,9],[130,7,130,9],[120,7,120,9],[119,7,119,9],[118,7,118,9],[164,1,164,2],[164,3,164,6],[164,7,164,9],[146,3,146,6],[146,7,146,9],[136,1,146,2],[137,3,137,6],[137,7,137,9],[138,3,138,6],[138,7,138,9],[139,3,139,6],[139,7,139,9],[143,3,143,6],[143,7,143,9],[144,3,144,6],[144,7,144,9],[140,3,140,6],[140,7,140,9],[141,3,141,6],[141,7,141,9],[131,7,131,9],[132,7,132,9],[133,7,133,9],[134,7,134,9],[134,3,134,6],[99,3,99,6],[133,3,133,6],[117,1,117,2],[117,3,117,6],[117,7,117,9],[118,1,126,2],[126,3,126,6],[125,3,125,6],[124,3,124,6],[123,3,123,6],[122,3,122,6],[121,3,121,6],[120,3,120,6],[119,3,119,6],[118,3,118,6],[126,7,126,9],[121,7,121,9],[125,7,125,9],[124,7,124,9],[128,3,128,6],[101,3,101,6],[100,3,100,6],[101,7,101,9],[100,7,100,9],[127,3,127,6],[127,7,127,9],[128,7,128,9],[129,7,129,9],[123,7,123,9],[122,7,122,9],[98,3,98,6],[97,3,97,6],[96,3,96,6],[95,3,95,6],[94,3,94,6],[96,7,96,9],[95,7,95,9],[94,7,94,9],[173,1,179,2],[94,1,102,2],[102,3,102,6],[102,7,102,9],[135,3,135,6],[135,7,135,9],[127,1,135,2],[98,7,98,9],[97,7,97,9],[99,7,99,9],[136,3,136,6],[136,7,136,9],[132,3,132,6],[131,3,131,6],[130,3,130,6],[129,3,129,6],[8,10,8,11],[93,3,93,6],[12,10,12,11],[15,10,15,11],[30,1,30,2],[28,1,29,2],[29,3,29,4],[28,3,28,10],[30,3,30,4],[29,9,29,10],[30,9,30,10],[29,5,29,8],[30,5,30,8],[93,1,93,2],[93,7,93,9]]}
[]
[null,null,null,null,null,null,null,null,null,"Filename:",{"$f":"\"R_\" & N5 & \"_rev_\" & LEFT(OTP_conf_file_generation!G13,1)","v":"R_PFS8416AMBGJES_rev_B"}]
[]
[]
[null,null,null,null,null,null,null,null,null,null,null,null,null,{"$f":"OTP_conf_file_generation!G4","v":"PFS8416AMBGJES"}]
[null,null,null,null,null,null,null,null,null,null,null,null,null,{"$f":"\"Configuration report for \" & LEFT(OTP_conf_file_generation!G3,6) & \" OTP program ID: \" & LEFT(UPPER(OTP_conf_file_generation!G12),2) & \" rev \" & LEFT(OTP_conf_file_generation!G13,1)","v":"Configuration report for FS8416 OTP program ID: GJ rev B"}]
[null,null,null,null,null,null,null,null,null,null,null,null,null,{"$f":"TODAY()","v":"2021-11-22"}]
[]
[]
[]
{"$rows_left_out":340}
{"sheet":"Load_OTP_&_Apply","index":2,"n_rows":52,"n_cols":23,"rows_kept":52,"cut":false,"hidden":true,"merged":[[10,19,10,22],[7,17,7,22],[8,17,8,22],[9,15,9,16],[9,17,9,18],[9,19,9,20],[9,21,9,22],[11,16,11,17],[11,18,11,22],[12,19,12,20],[12,17,12,18],[12,15,12,16],[12,21,12,22],[13,15,13,22],[14,18,14,19],[14,20,14,21],[15,15,15,22],[16,16,16,17],[16,19,16,20],[17,16,17,17],[17,18,17,22],[18,15,18,17],[18,18,18,20],[18,21,18,22],[22,15,22,16],[22,17,22,18],[19,16,19,18],[19,20,19,22],[20,17,20,19],[21,17,21,19],[20,20,20,22],[21,20,21,22],[22,20,22,22],[23,20,23,22],[24,20,24,22],[25,20,25,22],[25,17,25,19],[24,17,24,19],[23,17,23,19],[26,21,26,22],[29,15,29,21],[31,20,31,22],[30,19,30,22],[32,15,32,22],[40,19,40,22],[36,15,36,22],[37,15,37,18],[37,19,37,22],[39,19,39,22],[39,15,39,18],[38,18,38,22],[3,0,3,1],[48,20,48,21],[49,20,49,21],[47,19,47,22],[45,15,45,16],[47,15,47,17],[49,15,49,19],[48,15,48,16],[48,17,48,18],[40,15,40,18],[41,15,41,18],[42,15,42,18],[43,15,43,18],[43,19,43,22],[42,19,42,22],[41,19,41,22]]}
[null,null,null,null,null,null,null,null,null,null,null,null,null,null,null,null,{"$f":"IFERROR(MID(D5, SEARCH(\"FS8\",D5,1),9),\"\")","v":""},{"$f":"IFERROR(MID(D5, SEARCH(\"FS8\",D5,1),4),\"\")","v":""}]
[null,null,null,null,null,null,null,null,null,null,null,null,null,null,null,null,{"$f":"IF(Q1=\"\",\"\",IFERROR(MATCH(UPPER(Q1),OTP_conf_file_generation!I11:I24,0),-1))","v":""},{"$f":"IF(R1=\"\",\"\",IFERROR(MATCH(UPPER(R1),LEFT(OTP_conf_file_generation!I11:I24,4),0),-1))","v":""}]
[null,null,null,null,null,null,null,null,null,null,null,null,null,null,null,null,{"$f":"IFERROR(MID(D5, SEARCH(\"FS8\",D5,1)+9,2),\"\")","v":""},{"$f":"IFERROR(MID(D5, SEARCH(\"FS8\",D5,1)+6,2),\"\")","v":""}]
[null,null,null,"Part Number",null,"Rev",null,null,null,null,null,null,null,null,"OTP type","Device family","OTP program ID","Package","OTP ID revision"]
["Silicon & Flavor","C0",null,null,null,null,null,null,null,null,null,null,null,null,{"$f":"INDEX(OTP_conf_file_generation!G19:G21,IF(ISNA(O6),1,O6))","v":"P - Sampling"},{"$f":"IF(P6=\"\",OTP_conf_file_generation!I18,INDEX(OTP_conf_file_generation!I11:I24,IFERROR(MATCH(UPPER(P6),OTP_conf_file_generation!I11:I24,0),IFERROR(MATCH(UPPER(P6),LEFT(OTP_conf_file_generation!I11:I24,6),0),8))))","v":"FS8416AMB"},{"$f":"IF(OR(Q6=\"\",LEN(Q6)<2),\"--\",UPPER(Q6))","v":"--"},{"$f":"IF(R6=\"\",OTP_conf_file_generation!G17,INDEX(OTP_conf_file_generation!G16:G17,IFERROR(MATCH(UPPER(R6),LEFT(OTP_conf_file_generation!G16:G17,2),0),2)))","v":"ES - Step Cut"},{"$f":"IF(S6=\"\",\"-\",IFERROR(UPPER(S6),\"-\"))","v":"-"}]
["Customer & Application",null,null,null,null,null,null,null,null,null,null,null,null,null,{"$f":"MATCH(LEFT(D5,1),LEFT(OTP_conf_file_generation!G19:G21,1),0)","v":{"$error":"#N/A"}},{"$f":"IFERROR(MID(D5, SEARCH(\"FS8\",D5,1),9),\"\")","v":""},{"$f":"IFERROR(IF(Q2>=0,Q3,IF(R2>=0,R3,NaN)),\"\")","v":""},{"$f":"IFERROR(MID(D5, SEARCH(\"FS\",D5,1)+11,2),\"\")","v":""},{"$f":"RIGHT(F5,1)","v":""}]
["MAIN",null,null,null,null,null,null,null,null,null,null,null,null,null,"Register","Bit7","Bit6","Bit5","Bit4","Bit3","Bit2","Bit1","Bit0"]
[14,"0F",null,{"$f":"HEX2BIN(B8,8)","v":"00001111"},null,{"$f":"LEFT(D8,1)","v":"0"},{"$f":"MID(D8,2,1)","v":"0"},{"$f":"MID(D8,3,1)","v":"0"},{"$f":"MID(D8,4,1)","v":"0"},{"$f":"MID(D8,5,1)","v":"1"},{"$f":"MID(D8,6,1)","v":"1"},{"$f":"MID(D8,7,1)","v":"1"},{"$f":"RIGHT(D8,1)","v":"1"},null,"OTP_CFG_VPRE_1",0,0,{"$f":"VLOOKUP(_xlfn.CONCAT(H8:M8),OTP_conf_main_bits!B2:C6,2,FALSE)","v":"001111 - 3.3V"}]
[15,5,null,{"$f":"HEX2BIN(B9,8)","v":"00000101"},null,"0","0","0",{"$f":"MID(D9,4,1)","v":"0"},"0","1","0","1",null,"OTP_CFG_VPRE_2",0,0,{"$f":"VLOOKUP(_xlfn.CONCAT(H9:M9),OTP_conf_main_bits!B8:C18,2,FALSE)","v":"000101 - 50mV/µs"}]
[16,"6F",null,"01101111",null,"0","1","1","0","1","1","1","1",null,"OTP_CFG_VPRE_3",{"$f":"VLOOKUP(_xlfn.CONCAT(F10,G10),OTP_conf_main_bits!B20:C23,2,FALSE)","v":"01 - 80mV"},null,{"$f":"VLOOKUP(_xlfn.CONCAT(H10,I10),OTP_conf_main_bits!B25:C25,2,FALSE)","v":"10 - 40ns"},null,"11 - PU/PD/900mA",null,{"$f":"VLOOKUP(_xlfn.CONCAT(L10,M10),OTP_conf_main_bits!B29:C32,2,FALSE)","v":"11 - PU/PD/900mA"}]
{"$rows_left_out":43}
{"sheet":"OTP_conf_file_generation","index":3,"n_rows":46,"n_cols":17,"rows_kept":46,"cut":false,"hidden":false,"merged":[[0,0,1,0],[0,1,1,1],[0,2,1,2],[0,3,1,3]]}
["Logic","Register  Name","Register Address","Data"]
[]
["Main","OTP_CFG_VPRE_1","14",{"$f":"OTP_conf_main_reg!N5","v":"0x0F"},null,"Device family","FS8416AMB","Silicon","C0"]
["Main","OTP_CFG_VPRE_2","15",{"$f":"OTP_conf_main_reg!N7","v":"0x05"},null,"Part Number:",{"$f":"LEFT(G10,1)&G3&LEFT(UPPER(G12),2)&LEFT(G11,2)","v":"PFS8416AMBGJES"},"Flavor",{"$f":"G4 & \", Rev \" & G13","v":"PFS8416AMBGJES, Rev B"}]
["Main","OTP_CFG_VPRE_3","16",{"$f":"OTP_conf_main_reg!N9","v":"0xEF"},null,"Customer:",null,"Customer:"]
["Main","OTP_CFG_BOOST_1","17",{"$f":"OTP_conf_main_reg!N11","v":"0x06"},null,"Author:",null,"Application"]
["Main","OTP_CFG_BOOST_2","18",{"$f":"OTP_conf_main_reg!N13","v":"0x8C"},null,"File revision:","1.4","File repository:","C:\\"]
["Main","OTP_CFG_BOOST_3","19",{"$f":"OTP_conf_main_reg!N15","v":"0x07"},null,"File repository:","C:\\Users\\nxf32138\\Documents\\aaatest2.txt","File name:",{"$f":"I3&\"_\"&G4&\"_Rev\"&G13&\"_\"&I5&\"_\"&I6&\"_ATE.txt\"","v":"C0_PFS8416AMBGJES_RevB___ATE.txt"}]
["Main","OTP_CFG_BUCK1_1","1A",{"$f":"OTP_conf_main_reg!N17","v":"0x44"}]
["Main","OTP_CFG_BUCK1_2","1B",{"$f":"OTP_conf_main_reg!N19","v":"0x06"},null,"OTP type","P - Sampling",null,"Device options","BUCK3","LDO2","Psync","Ipre max","VMONx","FCCU","ABIST","ASIL"]
{"$rows_left_out":37}
{"sheet":"OTP_conf_summary","index":4,"n_rows":372,"n_cols":32,"rows_kept":372,"cut":false,"hidden":false,"merged":[[10,26,57,26],[39,3,39,4],[44,3,44,4],[52,3,52,4],[59,3,59,4],[13,14,18,18],[10,3,10,4],[10,6,11,18],[13,11,13,12],[18,11,18,12],[17,11,17,12],[16,11,16,12],[15,11,15,12],[14,11,14,12],[10,5,69,5],[10,2,83,2],[63,0,63,1],[11,3,11,4],[18,3,18,4],[29,3,29,4],[34,3,34,4],[58,0,58,1],[24,3,24,4],[53,0,53,1],[41,0,41,1],[10,0,10,1],[31,0,31,1],[21,0,21,1],[11,0,11,1],[67,3,67,4]]}
[null,null,null,null,null,null,"dt",{"$f":"(LEFT($B$65,LEN($B$65)-2)/10000)","v":0.1},null,null,null,{"$f":"B40","v":" Regulator Start and Stop in Slot 3"},{"$f":"B52","v":" Regulator Start and Stop in Slot 0"},{"$f":"B58","v":" Regulator Start and Stop in Slot 2"},{"$f":"B63","v":" Regulator Start and Stop in Slot 0"},null,null,null,null,null,"EXT.","by SPI"]
[null,null,null,null,null,null,null,null,null,null,null,null,{"$f":"B43","v":"Yes"},"Yes","Yes",null,null,null,null,null,"VPRE","EXT."]
[null,null,null,null,null,null,null,"V OTP",null,{"$f":"B13","v":" 3.3V"},{"$f":"B24","v":" 5.00V"},{"$f":"B33","v":" 0.825V"},{"$f":"B44","v":" 2.3V"},{"$f":"B55","v":" 1.8V"},{"$f":"B60","v":" 3.3V"},null,null,null,null,null,"BUCK3","VPRE"]
[null,null,null,null,null,null,null,"V after config (enable/slot)",null,{"$f":"J3","v":" 3.3V"},{"$f":"IF(EXACT($B$23,\"Yes\"),K3,J3)","v":" 5.00V"},{"$f":"SUBSTITUTE(L3,\"V\",\"\")","v":" 0.825"},{"$f":"IF(AND(EXACT(M2,\"Yes\"),M7<=6),M3,\"0V\")","v":" 2.3V"},{"$f":"IF(AND(EXACT(N2,\"Yes\"),N7<=6),N3,\"0V\")","v":" 1.8V"}," 3.3V",null,{"$f":"J15","v":" 3.3V"},1.6,null,null,"LDO1"]
[null,null,null,null,null,null,null,"V Number",null,{"$f":"ROUND(VALUE(SUBSTITUTE(J4,\"V\",\"\")),1)","v":3.3},{"$f":"ROUND(VALUE(SUBSTITUTE(K4,\"V\",\"\")),1)","v":5},{"$f":"ROUND(VALUE(SUBSTITUTE(L4,\"V\",\"\")),1)","v":0.8},{"$f":"ROUND(VALUE(SUBSTITUTE(M4,\"V\",\"\")),1)","v":2.2999999999999998},1.8,3.3,null,{"$f":"ROUND(VALUE(SUBSTITUTE(Q4,\"V\",\"\")),1)","v":3.3},{"$f":"ROUND(VALUE(SUBSTITUTE(R4,\"V\",\"\")),1)","v":1.6},null,null,"LDO2"]
[null,null,null,null,null,null,null,"SR",null,null,null,{"$f":"VALUE(LEFT($B$41,5))","v":7.81},{"$f":"VALUE(LEFT(B53,5))","v":10.4},{"$f":"N8/1","v":1.8},{"$f":"O8/1","v":3.1999999999999997}]
[null,null,null,null,null,null,null,"Slot",null,"p","b",{"$f":"IF(ISNUMBER(VALUE(RIGHT(L1,1))),VALUE(RIGHT(L1,1)),10)","v":3},{"$f":"IF(ISNUMBER(VALUE(RIGHT(M1,1))),VALUE(RIGHT(M1,1)),10)","v":0},{"$f":"IF(ISNUMBER(VALUE(RIGHT(N1,1))),VALUE(RIGHT(N1,1)),10)","v":2},{"$f":"IF(ISNUMBER(VALUE(RIGHT(O1,1))),VALUE(RIGHT(O1,1)),10)","v":0}]
[null,null,null,null,null,null,null,"V final",null,{"$f":"J5","v":3.3},{"$f":"IF(K5=0,0,K5-0.1*COUNTIF($J$5:J5,K5)-0.1*COUNTIF($J$8:J8,K5-0.1*COUNTIF($J$5:J5,K5)))","v":5},{"$f":"IF(L5=0,0,L5-0.1*COUNTIF($J$5:K5,L5)-0.1*COUNTIF($J$8:K8,L5-0.1*COUNTIF($J$5:K5,L5)))","v":0.8},{"$f":"IF(M5=0,0,M5-0.1*COUNTIF($J$5:L5,M5)-0.1*COUNTIF($J$8:L8,M5-0.1*COUNTIF($J$5:L5,M5)))","v":2.2999999999999998},{"$f":"IF(N5=0,0,N5-0.1*COUNTIF($J$5:M5,N5)-0.1*COUNTIF($J$8:M8,N5-0.1*COUNTIF($J$5:M5,N5)))","v":1.8},{"$f":"IF(O5=0,0,O5-0.1*COUNTIF($J$5:N5,O5)-0.1*COUNTIF($J$8:N8,O5-0.1*COUNTIF($J$5:N5,O5)))","v":3.1999999999999997},null,{"$f":"IF(Q5=0,0,Q5-0.1*COUNTIF($J$5:O5,Q5)-0.1*COUNTIF($J$8:O8,Q5-0.1*COUNTIF($J$5:O5,Q5)))","v":3.0999999999999996},{"$f":"IF(R5=0,0,R5-0.1*COUNTIF($J$5:O5,R5)-0.1*COUNTIF($J$8:O8,R5-0.1*COUNTIF($J$5:O5,R5)))","v":1.6}]
[null,null,null,null,null,null,null,"SR adjusted",null,null,null,{"$f":"IFERROR(L6*L8/L5,1)","v":7.81},{"$f":"IFERROR(M6*M8/M5,1)","v":10.4},{"$f":"IFERROR(N6*N8/N5,1)","v":1.8},{"$f":"IFERROR(O6*O8/O5,1)","v":3.1030303030303026}]
[null,null,null,null,null,null,null,null,null,null,null,{"$f":"SUBSTITUTE(RIGHT(LEFT(L1,45),7),\")\",\"\")","v":" Slot 3"},{"$f":"SUBSTITUTE(RIGHT(LEFT(M1,45),7),\")\",\"\")","v":" Slot 0"}," Slot 2"," Slot 0"]
{"$rows_left_out":363}
{"sheet":"OTP_conf_main_reg","index":5,"n_rows":59,"n_cols":16,"rows_kept":59,"cut":false,"hidden":false,"merged":[[56,4,56,11],[58,4,58,11],[1,0,1,13],[48,4,48,10],[50,8,50,11],[52,9,52,11],[54,4,54,11],[38,6,38,8],[38,9,38,11],[40,6,40,8],[40,9,40,11],[42,10,42,11],[32,6,32,8],[32,9,32,11],[34,9,34,11],[36,6,36,8],[31,9,31,11],[31,6,31,8],[30,6,30,8],[30,9,30,11],[33,9,33,11],[10,8,10,11],[12,5,12,6],[12,7,12,11],[14,4,14,5],[14,6,14,7],[14,8,14,9],[14,10,14,11],[4,6,4,11],[6,6,6,11],[8,4,8,5],[8,6,8,7],[8,8,8,9],[8,10,8,11],[57,4,57,11],[3,6,3,11],[5,6,5,11],[7,10,7,11],[7,8,7,9],[7,6,7,7],[7,4,7,5],[9,8,9,11],[13,10,13,11],[13,8,13,9],[13,6,13,7],[11,7,11,11],[11,5,11,6],[13,4,13,5],[15,4,15,11],[17,7,17,8],[55,4,55,11],[51,9,51,11],[39,9,39,11],[39,6,39,8],[41,10,41,11],[43,6,43,11],[49,8,49,11],[46,4,46,6],[47,4,47,10],[53,4,53,11],[17,9,17,10],[16,4,16,11],[19,4,19,11],[23,7,23,11],[25,10,25,11],[23,5,23,6],[25,7,25,9],[25,4,25,6],[21,5,21,6],[21,8,21,9],[24,5,24,6],[24,7,24,11],[18,7,18,8],[18,9,18,10],[20,4,20,11],[22,5,22,6],[35,9,35,11],[35,6,35,8],[37,9,37,11],[37,6,37,8],[18,4,18,6],[22,8,22,9],[36,9,36,11],[26,4,26,6],[26,7,26,9],[26,10,26,11],[28,5,28,7],[28,9,28,11],[27,9,27,11],[27,5,27,7],[29,9,29,11],[29,6,29,8],[17,4,17,6],[45,4,45,6],[33,4,33,5],[33,6,33,7],[34,4,34,5],[34,6,34,7]]}
[]
["MAIN OTP_REGISTERS"]
["Register  Name","ADDRESS","R/W","Default","BIT7","BIT6","BIT5","BIT4","BIT3","BIT2","BIT1","BIT0","Data_Bin","Data_Hex",null,"in red font, don't touch"]
["OTP_CFG_VPRE_1","14","RW","0000_0000","-","-","VPREV[5:0]"]
[null,null,null,null,0,0,"001111 - 3.3V",null,null,null,null,null,{"$f":"CONCATENATE(LEFT(E5,1),LEFT(F5,1),LEFT(G5,6))","v":"00001111"},{"$f":"\"0x\"&BIN2HEX(M5,2)","v":"0x0F"}]
["OTP_CFG_VPRE_2","15","RW","0000_0000","-","-","VPRESC[5:0]"]
[null,null,null,null,0,0,"000101 - 50mV/µs",null,null,null,null,null,{"$f":"CONCATENATE(E7,F7,LEFT(G7,6))","v":"00000101"},{"$f":"\"0x\"&BIN2HEX(M7,2)","v":"0x05"}]
["OTP_CFG_VPRE_3","16","RW","0000_0000","VPREILIM[1:0]",null,"VPRETOFF[1:0]",null,"VPRESRLS[1:0]",null,"VPRESRHS[1:0]"]
[null,null,null,null,"11 - 150mV",null,"10 - 40ns",null,"11 - PU/PD/900mA",null,"11 - PU/PD/900mA",null,{"$f":"CONCATENATE(LEFT(E9,2),LEFT(G9,2),LEFT(I9,2),LEFT(K9,2))","v":"11101111"},{"$f":"\"0x\"&BIN2HEX(M9,2)","v":"0xEF"}]
["OTP_CFG_BOOST_1","17","RW","0000_0000","-","-","VPRE_MODE","Reserved","VBSTV[3:0]"]
{"$rows_left_out":50}
{"sheet":"OTP_conf_main_bits","index":6,"n_rows":300,"n_cols":4,"rows_kept":300,"cut":false,"hidden":false,"merged":[[114,3,115,3],[117,3,119,3],[282,0,284,0],[247,0,249,0],[250,0,252,0],[253,0,257,0],[258,0,260,0],[261,0,263,0],[264,0,266,0],[267,0,269,0],[270,0,272,0],[241,0,242,0],[243,0,244,0],[245,0,246,0],[205,0,213,0],[214,0,222,0],[288,0,290,0],[291,0,299,0],[273,0,275,0],[276,0,278,0],[279,0,281,0],[223,0,231,0],[232,0,240,0],[285,0,287,0],[174,0,182,0],[196,0,204,0],[147,0,155,0],[156,0,164,0],[165,0,173,0],[193,0,195,0],[183,0,187,0],[188,0,192,0],[88,0,89,0],[81,0,84,0],[85,0,87,0],[138,0,146,0],[113,0,119,0],[120,0,122,0],[123,0,125,0],[126,0,134,0],[90,0,91,0],[135,0,137,0],[92,0,94,0],[95,0,98,0],[99,0,112,0],[1,0,5,0],[18,0,22,0],[53,0,54,0],[55,0,57,0],[58,0,80,0],[23,0,24,0],[25,0,26,0],[27,0,31,0],[35,0,37,0],[51,0,52,0],[38,0,40,0],[48,0,50,0],[41,0,43,0],[44,0,47,0],[6,0,17,0],[32,0,34,0]]}
["Bit name",null,"Bit description","Comments"]
["VpreV[5:0]",null,"VPRE output voltage"]
[null,{"$f":"LEFT(C3,LEN(C3)-(LEN(C3)-FIND(\"-\",C3,1))-2)","v":"001111"},"001111 - 3.3V"]
[null,{"$f":"LEFT(C4,LEN(C4)-(LEN(C4)-FIND(\"-\",C4,1))-2)","v":"010100"},"010100 - 3.8V"]
[null,"010111","010111 - 4.1V"]
[null,"100000","100000 - 5.0V"]
["VPRESC[5:0]",null,"VPRE slope compensation"]
[null,"000100","000100 - 40mV/µs"]
[null,"000101","000101 - 50mV/µs"]
[null,"000110","000110 - 60mV/µs"]
{"$rows_left_out":291}
{"sheet":"OTP_conf_failsafe_reg","index":7,"n_rows":35,"n_cols":16,"rows_kept":35,"cut":false,"hidden":false,"merged":[[27,6,27,7],[27,9,27,10],[28,6,28,7],[28,9,28,10],[30,9,30,10],[29,9,29,10],[32,4,32,11],[34,4,34,11],[18,4,18,7],[18,8,18,11],[22,4,22,5],[26,4,26,6],[26,8,26,11],[31,4,31,11],[33,4,33,11],[25,8,25,11],[25,4,25,6],[21,4,21,5],[27,4,27,5],[28,4,28,5],[29,4,29,8],[30,4,30,8],[17,4,17,7],[3,4,3,11],[5,8,5,11],[12,4,12,7],[12,8,12,11],[14,4,14,7],[14,8,14,11],[16,4,16,7],[16,8,16,11],[9,8,9,11],[9,4,9,7],[11,8,11,11],[13,8,13,11],[15,8,15,11],[17,8,17,11],[10,4,10,7],[10,8,10,11],[11,4,11,7],[13,4,13,7],[15,4,15,7],[1,0,1,13],[4,4,4,11],[6,4,6,7],[6,8,6,11],[8,7,8,11],[5,4,5,7],[7,7,7,11]]}
[]
["FAIL-SAFE OTP_REGISTERS"]
["Register  Name","ADDRESS","R/W","Default","BIT7","BIT6","BIT5","BIT4","BIT3","BIT2","BIT1","BIT0","Data_Bin","Data_Hex",null,"in red font, don't touch\n"]
["OTP_CFG_UVOV_1","0A","R/W","0000_0000","VCORE_V[7:0]"]
[null,null,null,null,{"$f":"OTP_conf_main_reg!E17","v":"01000100 - 0.825V"},null,null,null,null,null,null,null,{"$f":"LEFT(E5,8)","v":"01000100"},{"$f":"\"0x\"&BIN2HEX(M5,2)","v":"0x44"}]
["OTP_CFG_UVOV_2","0B","R/W","0000_0000","VDDIOOVTH[3:0]",null,null,null,"VCOREOVTH[3:0]"]
[null,null,null,null,"0000 - 104.5%",null,null,null,"0000 - 104.5%",null,null,null,{"$f":"CONCATENATE(LEFT(E7,4),LEFT(I7,4))","v":"00000000"},{"$f":"\"0x\"&BIN2HEX(M7,2)","v":"0x00"}]
["OTP_CFG_UVOV_3","0C","R/W","0000_0000","-","-","VDDIO_V","VCORE_SVS_CLAMP[4:0]"]
[null,null,null,null,0,0,"0 - 3.3V","00000 - No SVS",null,null,null,null,{"$f":"CONCATENATE(E9,F9,LEFT(G9,1),LEFT(H9,5))","v":"00000000"},{"$f":"\"0x\"&BIN2HEX(M9,2)","v":"0x00"}]
["OTP_CFG_UVOV_4","0D","R/W","0000_0000","VMON2OVTH[3:0]",null,null,null,"VMON1OVTH[3:0]"]
{"$rows_left_out":26}
{"sheet":"OTP_conf_failsafe_bits","index":8,"n_rows":301,"n_cols":4,"rows_kept":301,"cut":false,"hidden":false,"merged":[[253,0,255,0],[256,0,258,0],[247,0,249,0],[250,0,252,0],[298,0,300,0],[277,0,281,0],[285,0,289,0],[293,0,297,0],[282,0,284,0],[290,0,292,0],[274,0,276,0],[265,0,267,0],[268,0,270,0],[271,0,273,0],[259,0,261,0],[262,0,264,0],[232,0,234,0],[235,0,237,0],[238,0,240,0],[241,0,243,0],[244,0,246,0],[220,0,222,0],[229,0,231,0],[226,0,228,0],[223,0,225,0],[217,0,219,0],[1,0,17,0],[18,0,34,0],[35,0,37,0],[38,0,43,0],[214,0,216,0],[44,0,60,0],[61,0,77,0],[78,0,94,0],[95,0,111,0],[112,0,128,0],[129,0,145,0],[146,0,162,0],[163,0,179,0],[180,0,196,0],[197,0,213,0]]}
["Bit name",null,"Bit description","Comments"]
["VDDIOOVTH[3:0]",null,"VDDIO overvoltage threshold configuration"]
[null,{"$f":"LEFT(C3,LEN(C3)-(LEN(C3)-FIND(\"-\",C3,1))-2)","v":"0000"},"0000 - 104.5%"]
[null,"0001","0001 - 105%"]
[null,"0010","0010 - 105.5%"]
[null,"0011","0011 - 106%"]
[null,"0100","0100 - 106.5%"]
[null,"0101","0101 - 107%"]
[null,"0110","0110 - 107.5%"]
[null,"0111","0111 - 108%"]
{"$rows_left_out":292}
{"sheet":"FS84_VPRE_VBOOST_Components","index":9,"n_rows":52,"n_cols":16,"rows_kept":52,"cut":false,"hidden":false,"merged":[[16,1,16,3],[16,5,16,7],[16,9,16,11],[3,15,3,23],[5,1,5,3],[5,5,5,7],[5,9,5,11],[3,1,3,3],[3,5,3,7],[3,9,3,11],[1,1,1,3],[1,5,1,7],[1,9,1,11],[2,1,2,3],[2,5,2,7],[2,9,2,11]]}
[]
[null,"Inputs",null,null,null,"Inputs",null,null,null,"Inputs"]
[null,"Outputs",null,null,null,"Outputs",null,null,null,"Outputs"]
[null,"Normalized values",null,null,null,"Normalized values",null,null,null,"Normalized values",null,null,null,null,null,"Current mode regulation loop principle"]
[]
[null,"PI Filter",null,null,null,"PI Filter"]
[null,"Fpi = Fsw / 10",{"$f":"1000*C21/10","v":45500},"Hz",null,"Fpi = Fsw / 10",{"$f":"1000000*G21/10","v":222000},"Hz"]
[null,"Lpi",1,"uH",null,"Lpi",0.1,"uH"]
[null,"Cpi1_Vbat_Calculated",{"$f":"1000000/(2*2*3.14156*3.14156*C7*C7*C8/1000000)","v":12.235634576974752},"uF",null,"Cpi1_Vbat_Calculated",{"$f":"1000000/(2*2*3.14156*3.14156*G7*G7*G8/1000000)","v":5.1397659449277606},"uF"]
[null,"Cpi1_Vbat_Selected",10,"uF",null,"Cpi1_Vbat_Selected",2.2000000000000002,"uF"]
{"$rows_left_out":43}
{"sheet":"Normalized_R_C_Values","index":10,"n_rows":74,"n_cols":15,"rows_kept":74,"cut":false,"hidden":false,"merged":[[1,1,1,12],[1,14,1,24],[10,1,17,1],[10,2,13,2],[10,3,11,3],[10,5,17,5],[10,6,13,6],[10,7,11,7],[10,9,17,9],[10,10,13,10],[10,11,11,11],[12,3,13,3],[12,7,13,7],[12,11,13,11],[14,2,17,2],[14,3,15,3],[14,6,17,6],[14,7,15,7],[14,10,17,10],[14,11,15,11],[16,3,17,3],[16,7,17,7],[16,11,17,11],[18,1,25,1],[18,2,21,2],[18,3,19,3],[18,5,25,5],[18,6,21,6],[18,7,19,7],[18,9,25,9],[18,10,21,10],[18,11,19,11],[20,3,21,3],[20,7,21,7],[20,11,21,11],[22,2,25,2],[22,3,23,3],[22,6,25,6],[22,7,23,7],[22,10,25,10],[22,11,23,11],[24,3,25,3],[24,7,25,7],[24,11,25,11],[26,1,33,1],[26,2,29,2],[26,3,27,3],[26,5,33,5],[26,6,29,6],[26,7,27,7],[34,6,37,6],[34,7,35,7],[38,2,41,2],[30,2,33,2],[30,3,31,3],[30,6,33,6],[30,7,31,7],[30,10,33,10],[30,11,31,11],[32,3,33,3],[32,7,33,7],[32,11,33,11],[26,9,33,9],[26,10,29,10],[26,11,27,11],[28,3,29,3],[28,7,29,7],[28,11,29,11],[38,11,39,11],[40,3,41,3],[40,7,41,7],[40,11,41,11],[42,1,49,1],[42,2,45,2],[42,3,43,3],[42,5,49,5],[42,6,45,6],[42,7,43,7],[34,9,41,9],[34,10,37,10],[34,11,35,11],[36,3,37,3],[36,7,37,7],[36,11,37,11],[38,3,39,3],[38,6,41,6],[38,7,39,7],[38,10,41,10],[34,1,41,1],[34,2,37,2],[34,3,35,3],[34,5,41,5],[46,2,49,2],[46,3,47,3],[46,6,49,6],[46,7,47,7],[46,10,49,10],[46,11,47,11],[48,3,49,3],[48,7,49,7],[48,11,49,11],[42,9,49,9],[42,10,45,10],[42,11,43,11],[44,3,45,3],[44,7,45,7],[44,11,45,11],[54,2,57,2],[54,11,55,11],[56,3,57,3],[56,7,57,7],[56,11,57,11],[50,9,57,9],[50,10,53,10],[50,11,51,11],[52,3,53,3],[52,7,53,7],[52,11,53,11],[54,3,55,3],[54,6,57,6],[54,7,55,7],[54,10,57,10],[70,3,71,3],[70,6,73,6],[70,7,71,7],[70,10,73,10],[64,11,65,11],[58,9,65,9],[58,10,61,10],[58,11,59,11],[60,3,61,3],[60,7,61,7],[60,11,61,11],[70,11,71,11],[72,11,73,11],[66,9,73,9],[66,10,69,10],[62,10,65,10],[66,3,67,3],[66,5,73,5],[66,6,69,6],[66,7,67,7],[62,3,63,3],[62,6,65,6],[62,7,63,7],[72,3,73,3],[62,11,63,11],[64,3,65,3],[64,7,65,7],[50,1,57,1],[50,2,53,2],[50,3,51,3],[50,5,57,5],[66,11,67,11],[68,3,69,3],[68,7,69,7],[68,11,69,11],[66,1,73,1],[66,2,69,2],[70,2,73,2],[62,2,65,2],[72,7,73,7],[58,1,65,1],[58,2,61,2],[58,3,59,3],[58,5,65,5],[58,6,61,6],[58,7,59,7],[50,6,53,6],[50,7,51,7]]}
[]
[null,"Resistors",null,null,null,null,null,null,null,null,null,null,null,null,"Capacitors"]
[]
[null,"E12   10% tolerance"]
[null,"E24     5% tolerance"]
[null,"E48     2% tolerance"]
[null,"E96     1% tolerance"]
[null,"E192   0.5, 0.25, 0.1% and higher tolerances"]
[]
[null,"E24","E48","E96","E192","E24","E48","E96","E192","E24","E48","E96","E192"]
{"$rows_left_out":64}